�s���{���R�[�h���͎s�撬���R�[�h,NO,�s���{����,�s�撬����,����,����_�J�i,����_�ʏ�,����_�p��,����������,���,�ꏊ����,�Z��,����,�ܓx,�o�x,�d�b�ԍ�,�����ԍ�,�����i���j,�����i�P�ʁj,�@�l�ԍ�,���L�ғ�,�������w���,���p�\�j��,�J�n����,�I������,���p�\�������L����,�摜,�摜_���C�Z���X,�T�v,�T�v_�p��,����,����_�p��,URL,���l
032026,0000000001,��茧,�{�Îs,"�k��R�n��䑺�̎R��
���Y�p��R���N�V����",�L�^�J�~�T���`�J���C�����m�T���\���Z�C�T�����E�O�R���N�V����,,,�d�v�L�`����������,,,��茧�{�Îs���,,39.600139,141.680449,,,,,,,1975-02-18,,,,,,,,,,,,���w��
032026,0000000002,��茧,�{�Îs,���X�_�y,�N�������J�O��,���X�_�y,,�d�v���`����������,,,��茧�{�Îs�R��,,39.657809,141.942936,,,,,,,2006-03-15,,,,,,,,,,,,���w��
032026,0000000003,��茧,�{�Îs,�������ݒn���̐_�q��,���N�`���E�G���K���`�z�E�m�~�R�}�C,,,�L�^�쐬���̑[�u���u���ׂ����`�̖���������,,,��茧�{�Îs,,,,,,,,,,1993-11-26,,,,,,,,,,,,���w��
032026,0000000004,��茧,�{�Îs,��R�L��,�T�L���}�J�C�d�J,��R�L��,,�j��,,,��茧�{�Îs��R,,39.674496,141.959673,,,,,,,1996-07-16,,,,,,,,,,,,���w��
032026,0000000005,��茧,�{�Îs,��y���l,�W���E�h�K�n�},��y���l,,����,,,��茧�{�Îs�����l��,,39.652373,141.978588,,,,,,,2012-01-24,,,,,,,,,,,,���w��
032026,0000000006,��茧,�{�Îs,"���r��R�y�і�t�x��
���R�сE�X�ѐA���Q��",�n���`�l�T���I���r���N�V�_�P�m�R�E�U���^�C�E�V�������V���N�u�c�O�����N,,,���ʓV�R�L�O��,,,��茧�{�Îs��n,,39.558388,141.48894,,,,,,,1928-02-07,,,,,,,,,,,,���w��
032026,0000000007,��茧,�{�Îs,"���o���N���R�V�W���E
�~�c�o���ɐB�n",�q�f�V�}�N���R�V�W���E�~�c�o���n���V���N�`,,,�V�R�L�O��,,,��茧�{�Îs��L����,,39.669881,141.987745,,,,,,,1935-12-24,,,,,,,,,,,,���w��
032026,0000000008,��茧,�{�Îs,��R�̒�����,�T�L���}�m�V�I�t�L�A�i,������,,�V�R�L�O��,,,��茧�{�Îs��L����,,39.676622,141.981871,,,,,,,1939-09-07,,,,,,,,,,,,���w��
032026,0000000009,��茧,�{�Îs,��R�̘X�C��,�T�L���}�m���E�\�N�C��,?�C��,,�V�R�L�O��,,,��茧�{�Îs��L����,,39.662884,141.973448,,,,,,,1939-09-07,,,,,,,,,,,,���w��
032026,0000000010,��茧,�{�Îs,"���r��R�̃A�J�G�]�}
�c��������n",�n���`�l�T���m�A�J�G�]�}�c�W�Z�C�i���Q���`,,,�V�R�L�O��,,,��茧�{�Îs��n,,39.572271,141.481746,,,,,,,1939-09-07,,,,,,,,,,,,���w��
032026,0000000011,��茧,�{�Îs,�����ƏZ��剮,�����A�C�P�W���E�^�N�V���I�N,,,�o�^�L�`������,������,,��茧�{�Îs�Ìy��,,39.58207,141.935887,,,,,,,2007-10-22,,,,,,,,,,,,
032026,0000000012,��茧,�{�Îs,"�������𑢓X�X�܌���
��",�L���E�A�Y�}���V���]�E�e���e���|�P���V���I�N,,,�o�^�L�`������,������,,��茧�{�Îs�{��,,39.64358,141.953852,,,,,,,2019-03-29,,,,,,,,,,,,
032026,0000000013,��茧,�{�Îs,�������𑢓X��,�L���E�A�Y�}���V���]�E�e���T�J�O��,,,�o�^�L�`������,������,,��茧�{�Îs�{��,,39.643613,141.95419,,,,,,,2019-03-29,,,,,,,,,,,,
032026,0000000014,��茧,�{�Îs,�������𑢓X����,�L���E�A�Y�}���V���]�E�e���V�`�O��,,,�o�^�L�`������,������,,��茧�{�Îs�{��,,39.643778,141.953815,,,,,,,2019-03-29,,,,,,,,,,,,
032026,0000000015,��茧,�{�Îs,�������뉀,�����A�C�V�e�C�G��,,,�o�^�L�O��,,,��茧�{�Îs�Ìy��,,39.581876,141.936005,,,,,,,2012-01-24,,,,,,,,,,,,
032026,0000000016,��茧,�{�Îs,���q��,�V�V�K�V��,,,�L�`������,���p�H�|�i,,��茧�{�Îs�{��,,,,,,,,,,1963-12-24,,,,,,,,,,,,���w��E�ǉ��w��1983-12-13
032026,0000000017,��茧,�{�Îs,�ؑ����󑠕�F����,���N�]�E�R�N�]�E�{�T�c�U�]�E,,,�L�`������,���p�H�|�i,,��茧�{�Îs����,,39.642345,141.934556,,,,,,,2020-04-07,,,,,,,,,,,,���w��
032026,0000000018,��茧,�{�Îs,�S��,�e�b�p�`,,,�L�`������,���p�H�|�i,,��茧�{�Îs�R��,,,,,,,,,�l,1963-12-24,,,,,,,,,,,,���w��
032026,0000000019,��茧,�{�Îs,�����Õ��Q�o�y�i,�i�K�l�R�t���O���V���c�h�q��,,,�L�`������,���p�H�|�i,,��茧�{�Îs��R,,,,,,,,,,1994-05-17,,,,,,,,,,,,���w��
032026,0000000020,��茧,�{�Îs,�_���������n�W�㞊�U��,�E�������E�����X�J�V�W���N�N�W���E�P�T,,,�L�`������,���p�H�|�i,,��茧�����s,,,,,,,,,,1980-03-04,,,,,,,,,,,,���w��
032026,0000000021,��茧,�{�Îs,�������,�M���O���C�W���E,,,�L�`������,���p�H�|�i,,��茧�{�Îs��{,,39.62234,141.958653,,,,,,,2010-03-02,,,,,,,,,,,,���w��
032026,0000000022,��茧,�{�Îs,�c��O�Ō���,�^�V���l���u�c�P���o�C,,,����������,,,��茧�{�Îs��E,,,,,,,,,,2020-11-13,,,,,,,,,,,,���w��
032026,0000000023,��茧,�{�Îs,��Έꎚ�o��,�C�b�Z�L�C�`�W�L���E�d�J,,,�j��,,,��茧�{�Îs�ڍ���,,39.642477,141.941847,,,,,,,1975-03-04,,,,,,,,,,,,���w��
032026,0000000024,��茧,�{�Îs,��y���l,�W���E�h�K�n�},,,����,,,��茧�{�Îs�����l��,,39.652373,141.978588,,,,,,,1954-04-05,,,,,,,,,,,,���w��
032026,0000000025,��茧,�{�Îs,���ꕔ�̃E�~�l�R�ɐB�n,�T�J�x�m�E�~�l�R�n���V���N�`,,,�V�R�L�O��,,,��茧�{�Îs�c�V���R,,39.722715,141.985674,,,,,,,1959-03-17,,,,,,,,,,,,���w��
032026,0000000026,��茧,�{�Îs,�O����,�T���m�E�C��,,,�V�R�L�O��,,,��茧�{�Îs�c�V����,,39.733085,141.98128,,,,,,,1992-09-04,,,,,,,,,,,,���w��
032026,0000000027,��茧,�{�Îs,�c���_�Ђ̃u�i�E�C�k�u�i��,�^�N�T���W���W���m�u�i�E�C�k�u�i����,,,�V�R�L�O��,,,��茧�{�Îs�c��,,39.625962,141.888921,,,,,,,2010-03-02,,,,,,,,,,,,���w��
032026,0000000028,��茧,�{�Îs,���X�_�Ж{�a,�N�������W���W���z���f��,,,�L�`������,������,,��茧�{�Îs�R��,,39.660947,141.940768,,,,,,,1990-07-19,,,,,,,,,,,,�s�w��
032026,0000000029,��茧,�{�Îs,���R�c��t���~�q,�R���}�_���N�V�h�E�Y�V,,,�L�`������,������,,��茧�{�Îs���R�c,,39.634417,141.936691,,,,,,,1980-05-29,,,,,,,,,,,,�s�w��
032026,0000000030,��茧,�{�Îs,���@�嚢��,�W�C���_�C�G���W,,,�L�`������,������,,��茧�{�Îs����,,39.514017,141.671496,,,,,,,1989-12-12,,,,,,,,,,,,�s�w��
032026,0000000031,��茧,�{�Îs,���ˊG,�X�M�g�G,,,�L�`������,���p�H�|�i,,��茧�{�Îs��c,,39.645761,141.955086,,,,,,,1989-06-27,,,,,,,,,,,,�s�w��
032026,0000000032,��茧,�{�Îs,����ɔ@����,�A�~�_�j�����C�]�E,,,�L�`������,���p�H�|�i,,��茧�{�Îs����,,39.642345,141.934556,,,,,,,1956-04-11,,,,,,,,,,,,�s�w��
032026,0000000033,��茧,�{�Îs,�����n��,�G�����C�W�]�E,,,�L�`������,���p�H�|�i,,��茧�{�Îs���̕l��,,39.650816,141.9695,,,,,,,1962-04-18,,,,,,,,,,,,�s�w��
032026,0000000034,��茧,�{�Îs,���ω���,�V���E�J���m���]�E,,,�L�`������,���p�H�|�i,,��茧�{�Îs���̕l��,,39.650815,141.9695,,,,,,,1962-04-18,,,,,,,,,,,,�s�w��
032026,0000000035,��茧,�{�Îs,���ϐ�����F����,�V���E�J���[�I���{�T�c���c�]�E,,,�L�`������,���p�H�|�i,,��茧�{�Îs����,,39.635086,141.962151,,,,,,,1989-06-27,,,,,,,,,,,,�s�w��
032026,0000000036,��茧,�{�Îs,�߉ގO����,�V���J�T���\���]�E,,,�L�`������,���p�H�|�i,,��茧�{�Îs�_�c��,,39.636536,141.918243,,,,,,,1979-07-24,,,,,,,,,,,,�s�w��
032026,0000000037,��茧,�{�Îs,������V��,�r�V�������e���]�E,,,�L�`������,���p�H�|�i,,��茧�{�Îs���R�c,,39.634396,141.936675,,,,,,,1962-04-18,,,,,,,,,,,,�s�w��
032026,0000000038,��茧,�{�Îs,������{�����Ԓ���,�W���E�A���W�z���h�E�����}�`���E�R�N,,,�L�`������,���p�H�|�i,,��茧�{�Îs��c,,39.645761,141.955086,,,,,,,1989-06-27,,,,,,,,,,,,�s�w��
032026,0000000039,��茧,�{�Îs,����@����,�_�C�j�`�j�����C�]�E,,,�L�`������,���p�H�|�i,,��茧�{�Îs����,,,,,,,,,�l,1998-07-24,,,,,,,,,,,,�s�w��
032026,0000000040,��茧,�{�Îs,���̍s�ҥ��S��,�G���m�M���E�W���E�j�L�]�E,,,�L�`������,���p�H�|�i,,��茧�{�Îs����,,,,,,,,,�l,1976-04-21,,,,,,,,,,,,�s�w��
032026,0000000041,��茧,�{�Îs,���R�c��t���{������,�R���}�_���N�V�h�E�z���]���J�P�{�g�P,,,�L�`������,���p�H�|�i,,��茧�{�Îs���R�c,,39.634396,141.936675,,,,,,,1980-05-29,,,,,,,,,,,,�s�w��
032026,0000000042,��茧,�{�Îs,�k��,���j�O�`,,,�L�`������,���p�H�|�i,,��茧�{�Îs�c��,,,,,,,,,�l,1993-12-22,,,,,,,,,,,,�s�w��
032026,0000000043,��茧,�{�Îs,�k��,���j�O�`,,,�L�`������,���p�H�|�i,,��茧�{�Îs�c��,,39.70593,141.907133,,,,,,,1993-12-22,,,,,,,,,,,,�s�w��
032026,0000000044,��茧,�{�Îs,�k��,���j�O�`,,,�L�`������,���p�H�|�i,,��茧�{�Îs�{��,,,,,,,,,,1986-06-25,,,,,,,,,,,,�s�w��
032026,0000000045,��茧,�{�Îs,����,�{���V���E,,,�L�`������,���p�H�|�i,,��茧�{�Îs�{��,,,,,,,,,,1986-06-25,,,,,,,,,,,,�s�w��
032026,0000000046,��茧,�{�Îs,�\���Ԑ�����,�W���E�n�`�P���z�V�J�u�g�n�`,,,�L�`������,���p�H�|�i,,��茧�{�Îs����,,,,,,,,,�l,2009-05-21,,,,,,,,,,,,�s�w��
032026,0000000047,��茧,�{�Îs,�O�\��ԋ؊�,�T���W���E�j�P���X�W�J�u�g,,,�L�`������,���p�H�|�i,,��茧�{�Îs����,,,,,,,,,�l,2009-05-21,,,,,,,,,,,,�s�w��
032026,0000000048,��茧,�{�Îs,�O�\�l�ԋ؊�,�T���W���E�����P���X�W�J�u�g,,,�L�`������,���p�H�|�i,,��茧�{�Îs��R,,,,,,,,,,2009-05-21,,,,,,,,,,,,�s�w��
032026,0000000049,��茧,�{�Îs,�����Ƒ���������,�R���h�E�h�N�\���U�]�E�J�P�{�g�P,,,�L�`������,���p�H�|�i,,��茧�{�Îs���,,,,,,,,,,1989-12-12,,,,,,,,,,,,�s�w��
032026,0000000050,��茧,�{�Îs,���~�ԑo����,�h�E�o�C�J�\�E�`���E�L���E,,,�L�`������,���p�H�|�i,,��茧�{�Îs���,,,,,,,,,�l,1989-12-12,,,,,,,,,,,,�s�w��
032026,0000000051,��茧,�{�Îs,���T�b�n�o����,�h�E�L�b�R�E�W�\�E�`���E�L���E,,,�L�`������,���p�H�|�i,,��茧�{�Îs���,,,,,,,,,�l,1989-12-12,,,,,,,,,,,,�s�w��
032026,0000000052,��茧,�{�Îs,���e�ԑo����,�h�E�L�b�J�T���\�E�`���E�L���E,,,�L�`������,���p�H�|�i,,��茧�{�Îs���,,,,,,,,,�l,1989-12-12,,,,,,,,,,,,�s�w��
032026,0000000053,��茧,�{�Îs,���H����,�h�E�z�E���C�L���E,,,�L�`������,���p�H�|�i,,��茧�{�Îs���,,,,,,,,,,1989-12-12,,,,,,,,,,,,�s�w��
032026,0000000054,��茧,�{�Îs,���X�_�Е����Õ���,�N�������W���W���t�V���R�����W��,,,�L�`������,���p�H�|�i,,��茧�{�Îs�{��,,,,,,,,,,1993-12-22,,,,,,,,,,,,�s�w��
032026,0000000055,��茧,�{�Îs,�n�蓁,�����r�e�g�E,,,�L�`������,���p�H�|�i,,��茧�{�Îs���R,,,,,,,,,�l,1979-07-24,,,,,,,,,,,,�s�w��
032026,0000000056,��茧,�{�Îs,�p���I�p���h�L�V�A�̑����̉���,�p���I�p���h�L�V�A�m�\�N�V�m�J�Z�L,,,�L�`������,���p�H�|�i,,��茧�{�Îs�Ύs,,,,,,,,,,1998-07-24,,,,,,,,,,,,�s�w��
032026,0000000057,��茧,�{�Îs,��̔�,�����N�I�E�m�q,,,�L�`������,���p�H�|�i,,��茧�{�Îs�F�쒬,,39.650131,141.967236,,,,,,,1955-08-08,,,,,,,,,,,,�s�w��
032026,0000000058,��茧,�{�Îs,�����̔�,�J���d�J�m�q,,,�L�`������,���p�H�|�i,,��茧�{�Îs���ݒn,,39.64151,141.965949,,,,,,,1957-12-25,,,,,,,,,,,,�s�w��
032026,0000000059,��茧,�{�Îs,�D������,�I���x�g�E���E,,,�L�`������,���p�H�|�i,,��茧�{�Îs���ݒn,,39.64151,141.965949,,,,,,,1957-12-25,,,,,,,,,,,,�s�w��
032026,0000000060,��茧,�{�Îs,�G���Ǖ����W,�G�C���I�C���P�h�E�q���E,,,�L�`������,���p�H�|�i,,��茧�{�Îs�c��,,39.711398,141.884925,,,,,,,1979-07-24,,,,,,,,,,,,�s�w��
032026,0000000061,��茧,�{�Îs,���R�E�m���,�o�N�O�����E�V�{�q,,,�L�`������,���p�H�|�i,,��茧�{�Îs����,,39.635086,141.962151,,,,,,,1979-07-24,,,,,,,,,,,,�s�w��
032026,0000000062,��茧,�{�Îs,�q���ڋ��V�����{��,�{�N�A���x���M���E�V���~�`�N���E�q,,,�L�`������,���p�H�|�i,,��茧�{�Îs�Ύs,,39.612795,141.788049,,,,,,,1995-03-06,,,,,,,,,,,,�s�w��
032026,0000000063,��茧,�{�Îs,�q���ڋ������{��,�{�N�A���x���M���E�~�`�N���E�q,,,�L�`������,���p�H�|�i,,��茧�{�Îs寖�,,39.603971,141.773125,,,,,,,1976-04-21,,,,,,,,,,,,�s�w��
032026,0000000064,��茧,�{�Îs,�q���ڋ����H�J��H��,�{�N�A���x���M���E�h�E���J�C�T�N�R�E�O,,,�L�`������,���p�H�|�i,,��茧�{�Îs�Ύs,,,,,,,,,,1976-04-21,,,,,,,,,,,,�s�w��
032026,0000000065,��茧,�{�Îs,�ڋ��g�p�̑�ʎ�o,�x���M���E�V���E�m�_�C�n���j���L���E,,,�L�`������,���p�H�|�i,,��茧�{�Îs�Ύs,,,,,,,,,,1998-07-24,,,,,,,,,,,,�s�w��
032026,0000000066,��茧,�{�Îs,�ڋ���Q�P,�x���M���E�q�O���P,,,�L�`������,���p�H�|�i,,��茧�{�Îs����,,39.582423,141.852857,,,,,,,1991-07-25,,,,,,,,,,,,�s�w��
032026,0000000067,��茧,�{�Îs,�ڋ���Q�Q,�x���M���E�q�O���Q,,,�L�`������,���p�H�|�i,,��茧�{�Îs����,,39.576646,141.831232,,,,,,,1991-07-25,,,,,,,,,,,,�s�w��
032026,0000000068,��茧,�{�Îs,�ڋ���Q�R,�x���M���E�q�O���R,,,�L�`������,���p�H�|�i,,��茧�{�Îs����,,39.575457,141.829301,,,,,,,1991-07-25,,,,,,,,,,,,�s�w��
032026,0000000069,��茧,�{�Îs,�ڋ���Q�S,�x���M���E�q�O���S,,,�L�`������,���p�H�|�i,,��茧�{�Îs����,,39.576608,141.824259,,,,,,,1991-07-25,,,,,,,,,,,,�s�w��
032026,0000000070,��茧,�{�Îs,�ڋ���Q�T,�x���M���E�q�O���T,,,�L�`������,���p�H�|�i,,��茧�{�Îs����,,39.576749,141.815241,,,,,,,1991-07-25,,,,,,,,,,,,�s�w��
032026,0000000071,��茧,�{�Îs,�ڋ���Q�U,�x���M���E�q�O���U,,,�L�`������,���p�H�|�i,,��茧�{�Îs����,,39.576749,141.815241,,,,,,,1991-07-25,,,,,,,,,,,,�s�w��
032026,0000000072,��茧,�{�Îs,�ڋ���Q�V,�x���M���E�q�O���V,,,�L�`������,���p�H�|�i,,��茧�{�Îs����,,39.567443,141.853945,,,,,,,1991-07-25,,,,,,,,,,,,�s�w��
032026,0000000073,��茧,�{�Îs,�ڋ���Q�W,�x���M���E�q�O���W,,,�L�`������,���p�H�|�i,,��茧�{�Îs����,,39.567443,141.853945,,,,,,,1991-07-25,,,,,,,,,,,,�s�w��
032026,0000000074,��茧,�{�Îs,�ڋ���Q�X,�x���M���E�q�O���X,,,�L�`������,���p�H�|�i,,��茧�{�Îs�z�n,,,,,,,,,,1991-07-25,,,,,,,,,,,,�s�w��
032026,0000000075,��茧,�{�Îs,���{�J�R�v,�����g�J�C�U���n�C,,,�L�`������,���p�H�|�i,,��茧�{�Îs�a���,,39.700804,141.657511,,,,,,�l,1998-07-24,,,,,,,,,,,,�s�w��
032026,0000000076,��茧,�{�Îs,���i�Γ��k��,�I�E�G�C�C�V�g�E�o�q,,,�L�`������,���p�H�|�i,,��茧�{�Îs����,,39.603791,141.773125,,,,,,,1976-04-21,,,,,,,,,,,,�s�w��
032026,0000000077,��茧,�{�Îs,�Ǖ���,�I�C���P�q,,,�L�`������,���p�H�|�i,,��茧�{�Îs�c�V�z�c,,39.747105,141.974355,,,,,,,1984-01-23,,,,,,,,,,,,�s�w��
032026,0000000078,��茧,�{�Îs,���\��,�Q�����N�q,,,�L�`������,���p�H�|�i,,��茧�{�Îs�c�V�ق��X,,39.736839,141.967987,,,,,,,1984-01-23,,,,,,,,,,,,�s�w��
032026,0000000079,��茧,�{�Îs,�܊�̓����{��,�z���C���m�~�`�N���E�q,,,�L�`������,���p�H�|�i,,��茧�{�Îs�܊�,,39.598259,141.712716,,,,,,,2009-02-02,,,,,,,,,,,,�s�w��
032026,0000000080,��茧,�{�Îs,�V�؂̓����{��,���E�L�m�~�`�N���E�q,,,�L�`������,���p�H�|�i,,��茧�{�Îs�V��,,39.601789,141.691629,,,,,,,2009-02-02,,,,,,,,,,,,�s�w��
032026,0000000081,��茧,�{�Îs,�����≮�̓����{��,�I�J�����C�����m�~�`�N���E�q,,,�L�`������,���p�H�|�i,,��茧�{�Îs����,,39.608091,141.638033,,,,,,,2009-02-02,,,,,,,,,,,,�s�w��
032026,0000000082,��茧,�{�Îs,�ڋ������{��,�x���M���E�~�`�N���E�q,,,�L�`������,���p�H�|�i,,��茧�{�Îs�Ԍ��s,,39.631368,141.858661,,,,,,,2019-03-25,,,,,,,,,,,,�s�w��
032026,0000000083,��茧,�{�Îs,���a�O���n�k�Ôg�ʐ^����,�V���E���T�����N�W�V���c�i�~�V���V���J���p��,,,�L�`������,���p�H�|�i,,��茧�{�Îs��R,,,,,,,,,,2019-03-25,,,,,,,,,,,,�s�w��
032026,0000000084,��茧,�{�Îs,���R�c��t�����_��,�R���}�_���N�V�h�E���_�e�K�},,,�s�w�薯��������,,,��茧�{�Îs���R�c,,39.634417,141.936691,,,,,,,1980-05-29,,,,,,,,,,,,�s�w��
032026,0000000085,��茧,�{�Îs,�ѓ��������炳�ܖؑ�,�J���g�E�V�L�I�V���T�}���N�]�E,,,�s�w�薯��������,,,��茧�{�Îs���,,,,,,,,,,1989-12-12,,,,,,,,,,,,�s�w��
032026,0000000086,��茧,�{�Îs,�����O������,�E�V�t�V�l���u�c�P���o�C,,,�s�w�薯��������,,,��茧�{�Îs�i�����j,,,,,,,,,,1994-11-21,,,,,,,,,,,,�s�w��
032026,0000000087,��茧,�{�Îs,�c��O������,�^�V���l���u�c�P���o�C,,,�s�w�薯��������,,,��茧�{�Îs�c��,,,,,,,,,,1994-11-21,,,,,,,,,,,,�s�w��
032026,0000000088,��茧,�{�Îs,�ԗ֎��q�x��,�n�i���V�V�I�h��,,,�s�w�薯��������,,,��茧�{�Îs�ԗ�,,,,,,,,,,1994-11-21,,,,,,,,,,,,�s�w��
032026,0000000089,��茧,�{�Îs,���O�_�y,�X�G�}�G�J�O��,,,�s�w�薯��������,,,��茧�{�Îs�c�V���O,,,,,,,,,,1984-01-23,,,,,,,,,,,,�s�w��
032026,0000000090,��茧,�{�Îs,�����q�x��,�n�^�V�V�I�h��,,,�s�w�薯��������,,,��茧�{�Îs�c�V��,,,,,,,,,,1986-06-25,,,,,,,,,,,,�s�w��
032026,0000000091,��茧,�{�Îs,�ۑҎ��c��,�Z�b�^�C�i�i�c���m,,,�s�w�薯��������,,,��茧�{�Îs�c�V�ۑ�,,,,,,,,,,1986-06-25,,,,,,,,,,,,�s�w��
032026,0000000092,��茧,�{�Îs,�a����������q�x,���C�i�C�V�~�Y�V�V�I�h��,,,�s�w�薯��������,,,��茧�{�Îs�a���,,,,,,,,,,1996-04-15,,,,,,,,,,,,�s�w��
032026,0000000093,��茧,�{�Îs,�a������S�O�ŗx,���C�i�C�i�J�S�I���l���u�c�I�h��,,,�s�w�薯��������,,,��茧�{�Îs�a���,,,,,,,,,,1996-04-15,,,,,,,,,,,,�s�w��
032026,0000000094,��茧,�{�Îs,��������O�Ō���,�V���J�����_�C�l���u�c�P���o�C,,,�s�w�薯��������,,,��茧�{�Îs����,,,,,,,,,,1996-04-15,,,,,,,,,,,,�s�w��
032026,0000000095,��茧,�{�Îs,�Ύs���q�x,���C�`�V�V�I�h��,,,�s�w�薯��������,,,��茧�{�Îs�Ύs,,,,,,,,,,1996-04-15,,,,,,,,,,,,�s�w��
032026,0000000096,��茧,�{�Îs,寖ڎ��q�x,�q�L���V�V�I�h��,,,�s�w�薯��������,,,��茧�{�Îs寖�,,,,,,,,,,1996-04-15,,,,,,,,,,,,�s�w��
032026,0000000097,��茧,�{�Îs,���򎂎q�x��,�R�U���V�V�I�h��,,,�s�w�薯��������,,,��茧�{�Îs����,,,,,,,,,,2009-05-21,,,,,,,,,,,,�s�w��
032026,0000000098,��茧,�{�Îs,�Ìy�΂��񂳗x��,�c�K���C�V�T���T�I�h��,,,�s�w�薯��������,,,��茧�{�Îs�Ìy��,,,,,,,,,,2009-05-21,,,,,,,,,,,,�s�w��
032026,0000000099,��茧,�{�Îs,���򌕕�,�i�K�T���P���o�C,,,�s�w�薯��������,,,��茧�{�Îs����,,,,,,,,,,2009-05-21,,,,,,,,,,,,�s�w��
032026,0000000100,��茧,�{�Îs,���ڂ��񂳗x��,�~�i�~�J�����T���T�I�h��,,,�s�w�薯��������,,,��茧�{�Îs����,,,,,,,,,,2009-05-21,,,,,,,,,,,,�s�w��
032026,0000000101,��茧,�{�Îs,���p�_�y,�}�b�J�N�J�O��,,,�s�w�薯��������,,,��茧�{�Îs����,,,,,,,,,,1989-12-12,,,,,,,,,,,,�s�w��
032026,0000000102,��茧,�{�Îs,�]?���r���_�y,�G�c�i�M�n���`�l�J�O��,,,�s�w�薯��������,,,��茧�{�Îs�]�q,,,,,,,,,,1989-12-12,,,,,,,,,,,,�s�w��
032026,0000000103,��茧,�{�Îs,�ĉ����x,�i�c���V�J�I�h��,,,�s�w�薯��������,,,��茧�{�Îs�ĉ�,,,,,,,,,,1989-12-12,,,,,,,,,,,,�s�w��
032026,0000000104,��茧,�{�Îs,���Ύ��x,�n�R�C�V�V�V�I�h��,,,�s�w�薯��������,,,��茧�{�Îs����,,,,,,,,,,1989-12-12,,,,,,,,,,,,�s�w��
032026,0000000105,��茧,�{�Îs,���p���x,�}�b�J�N�J�V�V�I�h��,,,�s�w�薯��������,,,��茧�{�Îs����,,,,,,,,,,1989-12-12,,,,,,,,,,,,�s�w��
032026,0000000106,��茧,�{�Îs,����˓�,�J���C�~�h�C��,,,�s�w�薯��������,,,��茧�{�Îs���,,,,,,,,,,1989-12-12,,,,,,,,,,,,�s�w��
032026,0000000107,��茧,�{�Îs,���΂������肱,�n�R�C�V�R�E�L���R,,,�s�w�薯��������,,,��茧�{�Îs����,,,,,,,,,,1989-12-12,,,,,,,,,,,,�s�w��
032026,0000000108,��茧,�{�Îs,���p�}�x��,�}�b�J�N�J�T�I�h��,,,�s�w�薯��������,,,��茧�{�Îs����,,,,,,,,,,2006-12-01,,,,,,,,,,,,�s�w��
032026,0000000109,��茧,�{�Îs,����O�Ō���,�J���E�`�l���u�c�P���o�C,,,�s�w�薯��������,,,��茧�{�Îs���,,,,,,,,,,2006-12-01,,,,,,,,,,,,�s�w��
032026,0000000110,��茧,�{�Îs,���V�Օ�,���U���g���}�C,,,�s�w�薯��������,,,��茧�{�Îs����,,,,,,,,,,2008-01-31,,,,,,,,,,,,�s�w��
032026,0000000111,��茧,�{�Îs,������x,�J���E�`�V�V�I�h��,,,�s�w�薯��������,,,��茧�{�Îs���,,,,,,,,,,2009-02-02,,,,,,,,,,,,�s�w��
032026,0000000112,��茧,�{�Îs,���V���x,���U���V�V�I�h��,,,�s�w�薯��������,,,��茧�{�Îs����,,,,,,,,,,2009-02-02,,,,,,,,,,,,�s�w��
032026,0000000113,��茧,�{�Îs,�]?����,�G�c�i�M�P���o�C,,,�s�w�薯��������,,,��茧�{�Îs�]�q,,,,,,,,,,2009-09-01,,,,,,,,,,,,�s�w��
032026,0000000114,��茧,�{�Îs,���L�N�x��,�J���C�I�E�l���I�h��,,,�s�w�薯��������,,,��茧�{�Îs���,,,,,,,,,,2009-09-01,,,,,,,,,,,,�s�w��
032026,0000000115,��茧,�{�Îs,�암�ؔ҉S,�i���u�R�r�L�E�^,,,�s�w�薯��������,,,��茧�{�Îs���,,,,,,,,,,2022-02-16,,,,,,,,,,,,�s�w��
032026,0000000116,��茧,�{�Îs,���Z���_�씽�Ò�,�Q���W���E�A���M�Z���z�S�d�J,,,�j��,,,��茧�{�Îs����,,39.642345,141.934556,,,,,,,1979-07-24,,,,,,,,,,,,�s�w��
032026,0000000117,��茧,�{�Îs,�M��,�t�f�d�J,,,�j��,,,��茧�{�Îs�L����㒬,,39.643894,141.965713,,,,,,,1979-07-24,,,,,,,,,,,,�s�w��
032026,0000000118,��茧,�{�Îs,���R�E�m�̕�,�J���O�����E�V�m�n�J,,,�j��,,,��茧�{�Îs�����c�n,,39.646355,141.963074,,,,,,,1979-07-24,,,,,,,,,,,,�s�w��
032026,0000000119,��茧,�{�Îs,���R�������E�q��̕�,�J���O���R�j�V�V���E�G�����m�n�J,,,�j��,,,��茧�{�Îs��c,,39.645761,141.955086,,,,,,,1979-07-24,,,,,,,,,,,,�s�w��
032026,0000000120,��茧,�{�Îs,�\�O���Ɗ≮,�W���E�T���u�c�g�C����,,,�j��,,,��茧�{�Îs����,,39.567253,141.855608,,,,,,,1983-10-24,,,,,,,,,,,,�s�w��
032026,0000000121,��茧,�{�Îs,���������뎁�揊,�`���E�R���W�T�N���o�V�{�V��,,,�j��,,,��茧�{�Îs����,,39.642345,141.934556,,,,,,,1990-07-19,,,,,,,,,,,,�s�w��
032026,0000000122,��茧,�{�Îs,����ِ�,�l�W���E�^�e�A�g,,,�j��,,,��茧�{�Îs�V��,,39.626437,141.867828,,,,,,,1956-04-11,,,,,,,,,,,,�s�w��
032026,0000000123,��茧,�{�Îs,��{�ڈΐX�L��,�\�P�C�G�]�����J�C�d�J,,,�j��,,,��茧�{�Îs��{,,39.627013,141.957217,,,,,,,1956-04-11,,,,,,,,,,,,�s�w��
032026,0000000124,��茧,�{�Îs,���єz�Έ�\�Q,�n���^�C�n�C�Z�L�C�R�E�O��,,,�j��,,,��茧�{�Îs����,,39.602987,141.766108,,,,,,,1992-03-10,,,,,,,,,,,,�s�w��
032026,0000000125,��茧,�{�Îs,�v�������q�匹�����̕�,�N�W�`���E�U�G�����~�i���g�m�n���E�W�m�n�J,,,�j��,,,��茧�{�Îs�c�V�ۑ�,,39.808794,141.958809,,,,,,,1994-12-19,,,,,,,,,,,,�s�w��
032026,0000000126,��茧,�{�Îs,�垐�V�ِ�,�_���{���e���^�e�A�g,,,�j��,,,��茧�{�Îs����,,39.514216,141.672751,,,,,,,1989-12-12,,,,,,,,,,,,�s�w��
032026,0000000127,��茧,�{�Îs,����ꗢ��,�n���T�J�C�`���d�J,,,�j��,,,��茧�{�Îs����,,39.624906,141.623704,,,,,,,2009-02-02,,,,,,,,,,,,�s�w��
032026,0000000128,��茧,�{�Îs,������,�C�`���E,,,�V�R�L�O��,,,��茧�{�Îs�{��,,39.636838,141.944883,,,,,,,1957-12-25,,,,,,,,,,,,�s�w��
032026,0000000129,��茧,�{�Îs,���Ԃ��̖�,�R�u�V�m�L,,,�V�R�L�O��,,,��茧�{�Îs�ԑO,,39.592591,141.969345,,,,,,,1962-04-18,,,,,,,,,,,,�s�w��E���{�Îs�w��1984-1-23
032026,0000000130,��茧,�{�Îs,�`���E�Z���A�J�V�W�~,�`���E�Z���A�J�V�W�~,,,�V�R�L�O��,,,�c���;�_�c��;�ۑҐ여��,,39.703326,141.900058,,,,,,,1986-07-01,,,,,,,,,,,,�s�w��
032026,0000000131,��茧,�{�Îs,�~���̋�~��,�J�V�i�C�m�R�}�h���_�N��,,,�V�R�L�O��,,,��茧�{�Îs�c�V�Óc,,39.714789,141.958018,,,,,,,1984-01-23,,,,,,,,,,,,�s�w��
032026,0000000132,��茧,�{�Îs,���R�_�Ђ̟O�̖�,�n�N�T���W���W���m�P���L�m�L,,,�V�R�L�O��,,,��茧�{�Îs�c�V�a��,,,,,,,,,,1984-01-23,,,,,,,,,,,,�s�w��
032026,0000000133,��茧,�{�Îs,�ԏ��̋���,�A�J�}�c�m�L���{�N,,,�V�R�L�O��,,,��茧�{�Îs�c�V���c��,,,,,,,,,,1998-10-01,,,,,,,,,,,,�s�w��
032026,0000000134,��茧,�{�Îs,�u�i�̋���,�u�i�m�L���{�N,,,�V�R�L�O��,,,��茧�{�Îs�c�V��q��,,,,,,,,,,1998-10-01,,,,,,,,,,,,�s�w��
032026,0000000135,��茧,�{�Îs,���^�Z�R�C�A,���^�Z�R�C�A,,�@,�V�R�L�O��,,,��茧�{�Îs�c�V�ق��X,,,,,,,,,,1998-10-01,,,,,,,,,,,,�s�w��
032026,0000000136,��茧,�{�Îs,�ۑґ哇,�Z�b�^�C�I�I�V�},,,�V�R�L�O��,,,��茧�{�Îs�c�V�ۑ�,,,,,,,,,,1994-10-01,,,,,,,,,,,,�s�w��
,,,,,,,,,,,,,,,,,,,,,,,,,,,,,,,,,
,,,,,,,,,,,,,,,,,,,,,,,,,,,,,,,,,
,,,,,,,,,,,,,,,,,,,,,,,,,,,,,,,,,
,,,,,,,,,,,,,,,,,,,,,,,,,,,,,,,,,
,,,,,,,,,,,,,,,,,,,,,,,,,,,,,,,,,
,,,,,,,,,,,,,,,,,,,,,,,,,,,,,,,,,
,,,,,,,,,,,,,,,,,,,,,,,,,,,,,,,,,
,,,,,,,,,,,,,,,,,,,,,,,,,,,,,,,,,
,,,,,,,,,,,,,,,,,,,,,,,,,,,,,,,,,
,,,,,,,,,,,,,,,,,,,,,,,,,,,,,,,,,
,,,,,,,,,,,,,,,,,,,,,,,,,,,,,,,,,
,,,,,,,,,,,,,,,,,,,,,,,,,,,,,,,,,
,,,,,,,,,,,,,,,,,,,,,,,,,,,,,,,,,
,,,,,,,,,,,,,,,,,,,,,,,,,,,,,,,,,
,,,,,,,,,,,,,,,,,,,,,,,,,,,,,,,,,
,,,,,,,,,���,,,,,,,,,,,,,,,,,,,,,,,,
,,,,,,,,�d�v������,������,,,,,,,,,,,,,,,,,,,,,,,,
,,,,,,,,����,���p�H�|�i,,,,,,,,,,,,,,,,,,,,,,,,
,,,,,,,,�o�^�L�`������,�|�\,,,,,,,,,,,,,,,,,,,,,,,,
,,,,,,,,�d�v���`������,�H�|�Z�p,,,,,,,,,,,,,,,,,,,,,,,,
,,,,,,,,�L�^�쐬���̑[�u���u���ׂ����`������,���̑�,,,,,,,,,,,,,,,,,,,,,,,,
,,,,,,,,�d�v�L�`����������,,,,,,,,,,,,,,,,,,,,,,,,,
,,,,,,,,�o�^�L�`����������,,,,,,,,,,,,,,,,,,,,,,,,,
,,,,,,,,�d�v���`����������,,,,,,,,,,,,,,,,,,,,,,,,,
,,,,,,,,�L�^�쐬���̑[�u���u���ׂ����`�̖���������,,,,,,,,,,,,,,,,,,,,,,,,,
,,,,,,,,�j��,,,,,,,,,,,,,,,,,,,,,,,,,
,,,,,,,,���ʎj��,,,,,,,,,,,,,,,,,,,,,,,,,
,,,,,,,,����,,,,,,,,,,,,,,,,,,,,,,,,,
,,,,,,,,���ʖ���,,,,,,,,,,,,,,,,,,,,,,,,,
,,,,,,,,�V�R�L�O��,,,,,,,,,,,,,,,,,,,,,,,,,
,,,,,,,,���ʓV�R�L�O��,,,,,,,,,,,,,,,,,,,,,,,,,
,,,,,,,,�o�^�L�O��,,,,,,,,,,,,,,,,,,,,,,,,,
,,,,,,,,�d�v�����I�i��,,,,,,,,,,,,,,,,,,,,,,,,,
,,,,,,,,�`���I�������Q�ۑ��n��,,,,,,,,,,,,,,,,,,,,,,,,,
,,,,,,,,�d�v�`���I�������Q�ۑ��n��,,,,,,,,,,,,,,,,,,,,,,,,,
,,,,,,,,�s�w�薯��������,,,,,,,,,,,,,,,,,,,,,,,,,
